{"text_format":"1","workbook":"xlsx","n_sheets":6,"sheets":["products","Your Quote","Help Tab","Short Throw Projectors","DO NOT OPEN","Logic"],"not_rendered":{"charts":0,"images":12,"macros":1,"external_links":0,"defined_names":11,"comments":1,"pivot_tables":0},"unopened":[],"bounds":{"document_bytes":16777216,"sheet_cells":100000,"rows_first":2000,"rows_last":500,"rows_between":2000,"halvings":0,"cell_chars":16384,"cell_head_chars":4096},"cells_cut":0,"cells_raw":0,"read":"whole","date_system":"1900"}

{"sheet":"products","index":0,"n_rows":260,"n_cols":17,"rows_kept":260,"cut":false,"hidden":false,"merged":[]}
[null,"V1.12.15.7.20",null,null,null,null,null,null,null,null,"``"]
[null,null,null,null,null,null,null,null,null,null,null,null,null,null,null,"Clici logo\nfor website"]
[null,null,null,null,null,null,null,null,null,null,null,null,null,null,null,"Clici logo\nfor website"]
[null,null,"NB -Requires Microsoft Excel and-needs macros and web services enabled to have full functions"]
["catalogid",null,"Your Screen \nSKU to order","EAN\nNumber","Start Filter Selection \nHERE           =>","SubType \n(If applicable)","View Size\n width mm","Format","Front/Rear\nFabric Type","If Electric   \nType of \nremote \nincluded","Control System\nRS232,Contacts,\n12V Trigger","Live \nStock","Product \nWebsite link","Weight","Carriage\nCharge",null,"   "]
[14,null,"SALFS221WSF",5060558500983,"Fixed Frame Screen",null,"2210mm","16by9","Ambient Light Fabric",null," ",{"$f":"IF(ISNA(INDEX('DO NOT OPEN'!D:D,MATCH(C6,'DO NOT OPEN'!A:A,0),0)),\"No Stock\",INDEX('DO NOT OPEN'!D:D,MATCH(C6,'DO NOT OPEN'!A:A,0),0))","v":4},{"$f":"HYPERLINK(\"http://www.sapphireav.com/Sapphire-Ambient-Light-Fixed-Frame-Screen-221cm-x-125cm_p_636.html\",\"Click for Web Link\")","v":"Click for Web Link"},19,"POA"]
[16,null,"SEFL155-V",5060558502888,"Electric Screen","Electric Floor ","1550mm","4by3","Matt White Front","Infra-red","Needs Optional STR",{"$f":"IF(ISNA(INDEX('DO NOT OPEN'!D:D,MATCH(C7,'DO NOT OPEN'!A:A,0),0)),\"No Stock\",INDEX('DO NOT OPEN'!D:D,MATCH(C7,'DO NOT OPEN'!A:A,0),0))","v":1},{"$f":"HYPERLINK(\"http://www.sapphireav.com/Sapphire-Electric-Floor-Screen-Infra-Red-Viewing-Area-1422mm-x-1607mm-43-Format-Approx-Case-Dimensions-L-1611mm-x-H-252mm-x-D-104mm_p_22.html\", \"Click for Web Link\")","v":"Click for Web Link"},18.5,15]
[18,null,"SESC180BV-A2",5060558504035,"Electric Screen","In-Ceiling Screen","1800mm","4by3","Matt White Front","Infra-red","RS232,Contacts,12V trig",{"$f":"IF(ISNA(INDEX('DO NOT OPEN'!D:D,MATCH(C8,'DO NOT OPEN'!A:A,0),0)),\"No Stock\",INDEX('DO NOT OPEN'!D:D,MATCH(C8,'DO NOT OPEN'!A:A,0),0))","v":0},{"$f":"HYPERLINK(\"http://www.sapphireav.com/Sapphire-Dedicated-Electric-Recessed-Screen-Viewing-Area-1707mm-x-1280mm-43-Approx-Case-Dimensions-Not-Including-Surround-L-1867mm-x-H-122mm-x-D-135mm_p_438.html\", \"Click for Web Link\")","v":"Click for Web Link"},11,15]
[22,null,"SESC180BWSF-A2",5060558504059,"Electric Screen","In-Ceiling Screen","1800mm","16by9","Matt White Front","Infra-red","RS232,Contacts,12V trig",{"$f":"IF(ISNA(INDEX('DO NOT OPEN'!D:D,MATCH(C9,'DO NOT OPEN'!A:A,0),0)),\"No Stock\",INDEX('DO NOT OPEN'!D:D,MATCH(C9,'DO NOT OPEN'!A:A,0),0))","v":5},{"$f":"HYPERLINK(\"http://www.sapphireav.com/Sapphire-Dedicated-Electric-Recessed-Screen-Viewing-Area-1705mm-x-959mm-169-Approx-Case-Dimensions-Not-Including-Surround-L-1867mm-x-H-122mm-x-D-135mm_p_439.html\", \"Click for Web Link\")","v":"Click for Web Link"},11,15]
[27,null,"SESC200B1610-A2",5060558501317,"Electric Screen","In-Ceiling Screen","2000mm","16by10","Matt White Front","Infra-red","RS232,Contacts,12V trig",{"$f":"IF(ISNA(INDEX('DO NOT OPEN'!D:D,MATCH(C10,'DO NOT OPEN'!A:A,0),0)),\"No Stock\",INDEX('DO NOT OPEN'!D:D,MATCH(C10,'DO NOT OPEN'!A:A,0),0))","v":18},{"$f":"HYPERLINK(\"http://www.sapphireav.com/Sapphire-dedicated-electric-recessed-screen-Viewing-Area-2032-x-1270mm-1610-Approx-Case-Dimensions-Not-Including-Surround-L-2192-x-H-122-x-D-135mm_p_440.html\", \"Click for Web Link\")","v":"Click for Web Link"},13,15]
{"$rows_left_out":251}
{"sheet":"Your Quote","index":1,"n_rows":282,"n_cols":257,"rows_kept":282,"cut":false,"hidden":false,"merged":[]}
[]
[]
[]
[]
[null,"Our recommendations are below. Cut and paste into your quote as required. **Note maximum of five products**"]
[]
[null,"Product Code('s)","SETTS240WSF-AW10RP","SETTS300WSF-AW10RP","SETTS350WSF-AW10RP",null,null,null,null,null,null,null,null,null,null,null,null,null,null,null,null,null,null,null,null,null,null,null,null,null,null,null,null,null,null,null,null,null,null,null,null,null,null,null,null,null,null,null,null,null,null,null,null,null,null,null,null,null,null,null,null,null,null,null,null,null,null,null,null,null,null,null,null,null,null,null,null,null,null,null,null,null,null,null,null,null,null,null,null,null,null,null,null,null,null,null,null,null,null,null,null,null,null,null,null,null,null,null,null,null,null,null,null,null,null,null,null,null,null,null,null,null,null,null,null,null,null,null,null,null,null,null,null,null,null,null,null,null,null,null,null,null,null,null,null,null,null,null,null,null,null,null,null,null,null,null,null,null,null,null,null,null,null,null,null,null,null,null,null,null,null,null,null,null,null,null,null,null,null,null,null,null,null,null,null,null,null,null,null,null,null,null,null,null,null,null,null,null,null,null,null,null,null,null,null,null,null,null,null,null,null,null,null,null,null,null,null,null,null,null,null,null,null,null,null,null,null,null,null,null,null,null,null,null,null,null,null,null,"SWS200WSF10-ASR2","SWS200WSF-ASR2","SWS240-ASR2","SWS240B-ASR2","SWS240BV","SWS240WSF","SWS240WSF10","SWS240WSF10-ASR2","SWS240WSF-ASR2","SWS270-ASR2","SWS270BV","SWS270WSF","SWS270WSF10","SWS270WSF10-ASR2","SWS270WSF-ASR2","SESC180B1610-A2","SETTS240WSF-AW10RP","SETTS300WSF-AW10RP","SETTS350WSF-AW10RP"]
[null,"EAN",5060558504172,5060558504189,5060558504196,null,null,null,null,null,null,null,null,null,null,null,null,null,null,null,null,null,null,null,null,null,null,null,null,null,null,null,null,null,null,null,null,null,null,null,null,null,null,null,null,null,null,null,null,null,null,null,null,null,null,null,null,null,null,null,null,null,null,null,null,null,null,null,null,null,null,null,null,null,null,null,null,null,null,null,null,null,null,null,null,null,null,null,null,null,null,null,null,null,null,null,null,null,null,null,null,null,null,null,null,null,null,null,null,null,null,null,null,null,null,null,null,null,null,null,null,null,null,null,null,null,null,null,null,null,null,null,null,null,null,null,null,null,null,null,null,null,null,null,null,null,null,null,null,null,null,null,null,null,null,null,null,null,null,null,null,null,null,null,null,null,null,null,null,null,null,null,null,null,null,null,null,null,null,null,null,null,null,null,null,null,null,null,null,null,null,null,null,null,null,null,null,null,null,null,null,null,null,null,null,null,null,null,null,null,null,null,null,null,null,null,null,null,null,null,null,null,null,null,null,null,null,null,null,null,null,null,null,null,null,null,null,null,5060558503274,5060558502444,5060558502475,5060558502451,5060558502468,5060558501010,5060558503243,5060558503281,5060558502482,5060558502505,5060558502499,5060558502529,5060558503250,5060558503298,5060558502512,5060558504202,5060558504172,5060558504189,5060558504196]
[null,"Product Type","Electric Screen","Electric Screen","Electric Screen",null,null,null,null,null,null,null,null,null,null,null,null,null,null,null,null,null,null,null,null,null,null,null,null,null,null,null,null,null,null,null,null,null,null,null,null,null,null,null,null,null,null,null,null,null,null,null,null,null,null,null,null,null,null,null,null,null,null,null,null,null,null,null,null,null,null,null,null,null,null,null,null,null,null,null,null,null,null,null,null,null,null,null,null,null,null,null,null,null,null,null,null,null,null,null,null,null,null,null,null,null,null,null,null,null,null,null,null,null,null,null,null,null,null,null,null,null,null,null,null,null,null,null,null,null,null,null,null,null,null,null,null,null,null,null,null,null,null,null,null,null,null,null,null,null,null,null,null,null,null,null,null,null,null,null,null,null,null,null,null,null,null,null,null,null,null,null,null,null,null,null,null,null,null,null,null,null,null,null,null,null,null,null,null,null,null,null,null,null,null,null,null,null,null,null,null,null,null,null,null,null,null,null,null,null,null,null,null,null,null,null,null,null,null,null,null,null,null,null,null,null,null,null,null,null,null,null,null,null,null,null,null,null,"Manual Wall Screen","Manual Wall Screen","Manual Wall Screen","Manual Wall Screen","Manual Wall Screen","Manual Wall Screen","Manual Wall Screen","Manual Wall Screen","Manual Wall Screen","Manual Wall Screen","Manual Wall Screen","Manual Wall Screen","Manual Wall Screen","Manual Wall Screen","Manual Wall Screen","Electric Screen","Electric Screen","Electric Screen","Electric Screen"]
[null,"Sub Type","Tab Tensioned Ch Fix ","Tab Tensioned Ch Fix ","Tab Tensioned Ch Fix ",null,null,null,null,null,null,null,null,null,null,null,null,null,null,null,null,null,null,null,null,null,null,null,null,null,null,null,null,null,null,null,null,null,null,null,null,null,null,null,null,null,null,null,null,null,null,null,null,null,null,null,null,null,null,null,null,null,null,null,null,null,null,null,null,null,null,null,null,null,null,null,null,null,null,null,null,null,null,null,null,null,null,null,null,null,null,null,null,null,null,null,null,null,null,null,null,null,null,null,null,null,null,null,null,null,null,null,null,null,null,null,null,null,null,null,null,null,null,null,null,null,null,null,null,null,null,null,null,null,null,null,null,null,null,null,null,null,null,null,null,null,null,null,null,null,null,null,null,null,null,null,null,null,null,null,null,null,null,null,null,null,null,null,null,null,null,null,null,null,null,null,null,null,null,null,null,null,null,null,null,null,null,null,null,null,null,null,null,null,null,null,null,null,null,null,null,null,null,null,null,null,null,null,null,null,null,null,null,null,null,null,null,null,null,null,null,null,null,null,null,null,null,null,null,null,null,null,null,null,null,null,null,null,"Premium Manual","Premium Manual","Premium Manual","Premium Manual","Standard Manual","Standard Manual","Standard Manual","Premium Manual","Premium Manual","Premium Manual","Standard Manual","Standard Manual","Standard Manual","Premium Manual","Premium Manual","In-Ceiling Screen","Tab Tensioned Ch Fix ","Tab Tensioned Ch Fix ","Tab Tensioned Ch Fix "]
{"$rows_left_out":273}
{"sheet":"Help Tab","index":2,"n_rows":18,"n_cols":9,"rows_kept":18,"cut":false,"hidden":false,"merged":[]}
[]
[]
[]
[null,"Your Screen SKU to order",null,"Sapphire code for the screen. Be careful as one wrong digit can we a very different product"]
[]
[null,"EAN Number",null,"Some are showing 12 digits but if you need 13 please put a zero in front. "]
[]
[null,"Type as start point",null,"Types of screen are :-",null,"Electric Projector Screen","Fixed frame","Portable","Wall Manual"]
[]
[null,"SubType \n(If applicable)"]
{"$rows_left_out":9}
{"sheet":"Short Throw Projectors","index":3,"n_rows":22,"n_cols":4,"rows_kept":22,"cut":false,"hidden":false,"merged":[]}
[]
[]
[]
[]
[null,"The problem with Short/Ultra Short throw projectors"]
[null,"To ensure that you are not uphappy with the results when using short or especially ultra short throw you need to bear the following in mind. Even the very best fabrics that are non tensions will have slight undullations."]
[null,"If you view the back of the fabric and look from the side you will see them. In normal use with a standard projector the fabric will look perfect. However if you use a projector with the light coming from a sharp angel downwards "]
[null,"the image will have wavy edges and you will even gets some shaddow lines on the screen with ultra short throw. "]
[]
[null,"Tensioned fabrics are the answer"]
{"$rows_left_out":13}
{"sheet":"DO NOT OPEN","index":4,"n_rows":407,"n_cols":33,"rows_kept":407,"cut":false,"hidden":true,"merged":[]}
["partno"," category_name"," product_name"," Stock_Available",null,null,null,null,null,null,null,null,null,null,null,null,null,null,null,null,null,null,null,null,null,null,"SFL122"]
["SSB75","Brackets","75cm Extention Screen Extention Brackets (Pair)",89,null,null,null,null,null,null,null,null,null,null,null,null,null,null,null,null,null,null,null,null,null,null,"SALFS221WSF",null,null,null,null,"SAPPL03","WWW.sappl03"]
["SSB50","Brackets","L Shape Screen Bracket 50cm pair",0,null,null,null,null,null,null,null,null,null,null,null,null,null,null,null,null,null,null,null,null,null,null,"SEFL155-V"]
["SAPUM100200","Brackets","SAPUM100200",92,null,null,null,null,null,null,null,null,null,null,null,null,null,null,null,null,null,null,null,null,null,null,"SESC180BV-A2","SAPPL03",null,"STR"]
["SAPUM70120","Brackets","SAPUM70120",245,null,null,null,null,null,null,null,null,null,null,null,null,null,null,null,null,null,null,null,null,null,null,"SESC180B1610-A2","SAPPL03",null,"STR"]
["SSB30","Brackets","Screen Extension Bracket 30cm Pair",1,null,null,null,null,null,null,null,null,null,null,null,null,null,null,null,null,null,null,null,null,null,null,"SESC200B1610-A2","SAPPL03",null,"STR"]
["SSM-BR","Brackets","Smart Move Ceiling Bracket",66,null,null,null,null,null,null,null,null,null,null,null,null,null,null,null,null,null,null,null,null,null,null,"SESC200BV-A2","SAPPL03",null,"STR"]
["VGA-HD10","Cables and Splitters","10m High Quality VGA Cable Male2Male",67,null,null,null,null,null,null,null,null,null,null,null,null,null,null,null,null,null,null,null,null,null,null,"SESC200BWSF-A2","SAPPL03",null,"STR"]
["VGA-HD10F","Cables and Splitters","10m Male Female VGA Cable",2,null,null,null,null,null,null,null,null,null,null,null,null,null,null,null,null,null,null,null,null,null,null,"SESC240B1610-A2","SAPPL03",null,"STR"]
["VGA-HD20F","Cables and Splitters","20m VGA Cable (Male - Female)",2,null,null,null,null,null,null,null,null,null,null,null,null,null,null,null,null,null,null,null,null,null,null,"SESC240BV-A2","SAPPL03",null,"STR"]
{"$rows_left_out":398}
{"sheet":"Logic","index":5,"n_rows":11,"n_cols":11,"rows_kept":11,"cut":false,"hidden":true,"merged":[]}
["Logic bank for complimentary products"]
[]
["SAPPL03","http://www.sapphireav.com/Sapphire-Electronic-Projector-Inceiling-Lift-To-Suit-Larger-Projectors_p_547.html",null,null,null,null,"iIf product = SESC* then SAPPL03 and link"]
["SSB30","http://www.sapphireav.com/search.asp?keyword=ssb30&search.x=0&search.y=0",null,null,null,null,"If product = SEWS*less than of =  SEWS400 or SETTS less than of = to SETTS300* then product = SSB30"]
["STR","http://www.sapphireav.com/Sapphire-Auto-Trigger-System_p_16.html",null,null,null,null,"If product = SEWS*less or SETTS* or SSM* then product = STR"]
["STRV102L","http://www.sapphireav.com/AV-Cabinet-with-three-shelves-light_p_450.html",null,null,null,null,"If Product = SEWS300* to SEWS500 then product = STRV102L"]
[]
[null,"All ATR screens","SEWSscreens","SETTS","SETC","SESC","SSM","STS","SFL","SFFS","SWS"]
["option 1","Swithc",null,"Switch","Switch","Switch","Swith","Bag",null,"Drape kit"]
["option 2","SSB","SSB","SSB","SAPPL03","SAPPL03","SAPL03",null,"VGA","VGA","SSB"]
{"$rows_left_out":1}